BDBM50324586 (R)-N-(2-(2-(Dimethylamino)ethoxy)-6-fluoro-4-(1H-pyrazol-4-yl)phenyl)-6-methoxy-1,2,3,4-tetrahydroisoquinoline-3-carboxamide::CHEMBL1215455
SMILES COc1ccc2CN[C@H](Cc2c1)C(=O)Nc1c(F)cc(cc1OCCN(C)C)-c1cn[nH]c1
InChI Key InChIKey=SWEIFXYFQSCGFH-OAQYLSRUSA-N
Data  2 IC50
  Tab Delimited (TSV)   2D SDfile   Computed 3D by Vconf -m prep SDfile
Find this compound or compounds like it in BindingDB:
Activity Spreadsheet -- Enzyme Inhibition Constant Data from BindingDB
Found 2 hits for monomerid = 50324586
TargetRho-associated protein kinase 2(Homo sapiens (Human))
The Scripps Research Institute
Curated by ChEMBL
LigandPNGBDBM50324586((R)-N-(2-(2-(Dimethylamino)ethoxy)-6-fluoro-4-(1H-...)
Affinity DataIC50:  190nM. Assay description: Inhibition of ROCK2 assessed as myosin light chain phosphorylation by cell-based assay
In DepthDetails ArticlePubMed
TargetRho-associated protein kinase 2(Homo sapiens (Human))
The Scripps Research Institute
Curated by ChEMBL
LigandPNGBDBM50324586((R)-N-(2-(2-(Dimethylamino)ethoxy)-6-fluoro-4-(1H-...)
Affinity DataIC50:  23nM. Assay description: Inhibition of ROCK2
In DepthDetails ArticlePubMed