BDBM50325109 CHEMBL1223316::N-(3-methoxy-4-(N-(2-methoxyphenyl)sulfamoyl)phenyl)picolinamide
SMILES COc1ccccc1NS(=O)(=O)c1ccc(NC(=O)c2ccccn2)cc1OC
InChI Key InChIKey=WUPKQCAFDJBBKT-UHFFFAOYSA-N
Data  1 EC50
  Tab Delimited (TSV)   2D SDfile   Computed 3D by Vconf -m prep SDfile
Find this compound or compounds like it in BindingDB:
Activity Spreadsheet -- Enzyme Inhibition Constant Data from BindingDB
Found 1 hit for monomerid = 50325109
TargetMetabotropic glutamate receptor 4(Homo sapiens (Human))
Vanderbilt University Medical Center
Curated by ChEMBL
LigandPNGBDBM50325109(CHEMBL1223316 | N-(3-methoxy-4-(N-(2-methoxyphenyl...)
Affinity DataEC50:  132nM. Assay description: Positive allosteric modulation of human mGlu4 receptor expressed in CHO cells assessed as potentiation of glutamate-induced calcium mobilization
In DepthDetails ArticlePubMed