BDBM50325112 CHEMBL1223313::N-(4-(N-(2-chlorophenyl)sulfamoyl)phenyl)thiophene-3-carboxamide
SMILES Clc1ccccc1NS(=O)(=O)c1ccc(NC(=O)c2ccsc2)cc1
InChI Key InChIKey=ZASNKCQMORAXHL-UHFFFAOYSA-N
Data  1 EC50
  Tab Delimited (TSV)   2D SDfile   Computed 3D by Vconf -m prep SDfile
Find this compound or compounds like it in BindingDB:
Activity Spreadsheet -- Enzyme Inhibition Constant Data from BindingDB
Found 1 hit for monomerid = 50325112
TargetMetabotropic glutamate receptor 4(Homo sapiens (Human))
Vanderbilt University Medical Center
Curated by ChEMBL
LigandPNGBDBM50325112(CHEMBL1223313 | N-(4-(N-(2-chlorophenyl)sulfamoyl)...)
Affinity DataEC50:  269nM. Assay description: Positive allosteric modulation of human mGlu4 receptor expressed in CHO cells assessed as potentiation of glutamate-induced calcium mobilization
In DepthDetails ArticlePubMed