BDBM50325115 CHEMBL1223241::N-(4-(N-(2-chlorophenyl)sulfamoyl)phenyl)-6-fluoropicolinamide
SMILES Fc1cccc(n1)C(=O)Nc1ccc(cc1)S(=O)(=O)Nc1ccccc1Cl
InChI Key InChIKey=GLUYPOGPLCBWGM-UHFFFAOYSA-N
Data  1 EC50
  Tab Delimited (TSV)   2D SDfile   Computed 3D by Vconf -m prep SDfile
Find this compound or compounds like it in BindingDB:
Activity Spreadsheet -- Enzyme Inhibition Constant Data from BindingDB
Found 1 hit for monomerid = 50325115
TargetMetabotropic glutamate receptor 4(Homo sapiens (Human))
Vanderbilt University Medical Center
Curated by ChEMBL
LigandPNGBDBM50325115(CHEMBL1223241 | N-(4-(N-(2-chlorophenyl)sulfamoyl)...)
Affinity DataEC50:  122nM. Assay description: Positive allosteric modulation of human mGlu4 receptor expressed in CHO cells assessed as potentiation of glutamate-induced calcium mobilization
In DepthDetails ArticlePubMed