BDBM50325981 CHEMBL1224769::Topsentinol K Trisulfate
SMILES CC(C)C(\C=C/[C@@H](C)[C@H]1CC[C@H]2[C@@H]3C[C@H](OS([O-])(=O)=O)[C@H]4C[C@H](OS([O-])(=O)=O)[C@H](C[C@]4(C)[C@H]3CC[C@]12C)OS([O-])(=O)=O)C(C)C
InChI Key InChIKey=ZWIWIZWZKQFDCL-OHVGJZEWSA-K
Data  1 IC50
  Tab Delimited (TSV)   2D SDfile   Computed 3D by Vconf -m prep SDfile
Find this compound or compounds like it in BindingDB:
Activity Spreadsheet -- Enzyme Inhibition Constant Data from BindingDB
Found 1 hit for monomerid = 50325981
TargetBeta-secretase 1(Homo sapiens (Human))
University Of Hawaii At Manoa
Curated by ChEMBL
LigandPNGBDBM50325981(CHEMBL1224769 | Topsentinol K Trisulfate)
Affinity DataIC50:  1.20E+3nM. Assay description: Inhibition of BACE1-mediated cleavage of amyloid precursor protein after 16 hrs by spectrophotometry
In DepthDetails ArticlePubMed