BDBM50326886 (R)-1-((S)-2-(2-((R)-1-((S)-2-amino-3-(4-hydroxyphenyl)propanoyl)pyrrolidin-2-yl)acetamido)-3-phenylpropanoyl)pyrrolidine-2-carboxamide::CHEMBL1255058
SMILES N[C@@H](Cc1ccc(O)cc1)C(=O)N1CCC[C@@H]1CC(=O)N[C@@H](Cc1ccccc1)C(=O)N1CCC[C@@H]1C(N)=O
InChI Key InChIKey=CRCDRPXNSXPMAX-DDKRZIBASA-N
Data  2 KI  2 IC50
  Tab Delimited (TSV)   2D SDfile   Computed 3D by Vconf -m prep SDfile
Find this compound or compounds like it in BindingDB:
Activity Spreadsheet -- Enzyme Inhibition Constant Data from BindingDB
Found 2 hits for monomerid = 50326886
TargetMu-type opioid receptor(Rattus norvegicus (rat))
Sapienza University Of Rome
Curated by ChEMBL
LigandPNGBDBM50326886((R)-1-((S)-2-(2-((R)-1-((S)-2-amino-3-(4-hydroxyph...)
Affinity DataKi:  30nM. Assay description: Displacement of [3H]DAMGO from mu opioid receptor in rat brain membrane after 3 hrs by liquid scintillation counting
In DepthDetails ArticlePubMed
TargetKappa-type opioid receptor(Rattus norvegicus (rat))
Sapienza University Of Rome
Curated by ChEMBL
LigandPNGBDBM50326886((R)-1-((S)-2-(2-((R)-1-((S)-2-amino-3-(4-hydroxyph...)
Affinity DataKi:  1.00E+4nM. Assay description: Displacement of [3H]DPDPE from kappa opioid receptor in rat brain membrane after 3 hrs by liquid scintillation counting
In DepthDetails ArticlePubMed