BDBM50327023 ((1R,2R,3R,5S)-2,3,5-trihydroxy-5-((3-hydroxy-1-(4-(octyloxy)phenylamino)-1-oxobutan-2-yl)carbamoyl)cyclohexyl) 3-(3,4-dihydroxyphenyl)acrylate::((1R,2R,3R,5S)-2,3,5-trihydroxy-5-(3-hydroxy-1-(4-(octyloxy)phenylamino)-1-oxobutan-2-ylcarbamoyl)cyclohexyl)3-(3,4-dihydroxyphenyl)acrylate::CHEMBL396607
SMILES CCCCCCCCOc1ccc(NC(=O)C(NC(=O)[C@]2(O)C[C@@H](O)[C@@H](O)[C@@H](C2)OC(=O)\C=C\c2ccc(O)c(O)c2)C(C)O)cc1
InChI Key InChIKey=FVGZSRRIKXOWRJ-UFGNPURYSA-N
Data  1 IC50
  Tab Delimited (TSV)   2D SDfile   Computed 3D by Vconf -m prep SDfile
Find this compound or compounds like it in BindingDB:
Activity Spreadsheet -- Enzyme Inhibition Constant Data from BindingDB
Found 1 hit for monomerid = 50327023
Target1,3-beta-D-glucan synthase catalytic subunit(Candida albicans)
Inner Mongolia University
Curated by ChEMBL
LigandPNGBDBM50327023(((1R,2R,3R,5S)-2,3,5-trihydroxy-5-((3-hydroxy-1-(4...)
Affinity DataIC50: >4.90E+4nM. Assay description: Inhibition of Candida albicans 1,3 beta-D-glucan synthase
In DepthDetails ArticlePubMed