BDBM50327029 5-amino-2-(3-(3,4-dihydroxyphenyl)acrylamido)-N-(4-(octyloxy)phenyl)pentanamide::CHEMBL1254748
SMILES CCCCCCCCOc1ccc(NC(=O)C(CCCN)NC(=O)\C=C\c2ccc(O)c(O)c2)cc1
InChI Key InChIKey=VXHOTIXTDQAMLQ-GZTJUZNOSA-N
Data  1 IC50
  Tab Delimited (TSV)   2D SDfile   Computed 3D by Vconf -m prep SDfile
Find this compound or compounds like it in BindingDB:
Activity Spreadsheet -- Enzyme Inhibition Constant Data from BindingDB
Found 1 hit for monomerid = 50327029
Target1,3-beta-D-glucan synthase catalytic subunit(Candida albicans)
Inner Mongolia University
Curated by ChEMBL
LigandPNGBDBM50327029(5-amino-2-(3-(3,4-dihydroxyphenyl)acrylamido)-N-(4...)
Affinity DataIC50:  2.20E+4nM. Assay description: Inhibition of Candida albicans 1,3 beta-D-glucan synthase
In DepthDetails ArticlePubMed