BDBM50327033 CHEMBL1253514::tert-butyl 4-(3-(3,4-dihydroxyphenyl)acrylamido)-5-(4-(octyloxy)phenylamino)-5-oxopentylcarbamate
SMILES CCCCCCCCOc1ccc(NC(=O)C(CCCNC(=O)OC(C)(C)C)NC(=O)C=Cc2ccc(O)c(O)c2)cc1
InChI Key InChIKey=OKJVVSRMMOTBCQ-UHFFFAOYSA-N
Data  1 IC50
  Tab Delimited (TSV)   2D SDfile   Computed 3D by Vconf -m prep SDfile
Find this compound or compounds like it in BindingDB:
Activity Spreadsheet -- Enzyme Inhibition Constant Data from BindingDB
Found 1 hit for monomerid = 50327033
Target1,3-beta-D-glucan synthase catalytic subunit(Candida albicans)
Inner Mongolia University
Curated by ChEMBL
LigandPNGBDBM50327033(CHEMBL1253514 | tert-butyl 4-(3-(3,4-dihydroxyphen...)
Affinity DataIC50:  5.20E+4nM. Assay description: Inhibition of Candida albicans 1,3 beta-D-glucan synthase
In DepthDetails ArticlePubMed