BDBM50327038 (3aR,5R,6S,7R,7aR)-5-(hydroxymethyl)-2-methyl-5,6,7,7a-tetrahydro-3aH-pyrano[3,2-d]thiazole-6,7-diol::(3aR,5R,6S,7R,7aR)-5-(hydroxymethyl)-2-methyl-5,6,7,7a-tetrahydropyrano[3,2-d]thiazole-6,7-diol::3AR,5R,6S,7R,7AR-5-HYDROXYMETHYL-2-METHYL-5,6,7,7A-TETRAHYDRO-3AH-PYRANO[3,2-D]THIAZOLE-6,7-DIOL::CHEMBL257158::N-acetylglucosamine thiazoline
SMILES CC1=N[C@H]2[C@H](O[C@H](CO)[C@@H](O)[C@@H]2O)S1
InChI Key InChIKey=DRHXTSWSUAJOJZ-FMDGEEDCSA-N
Data  8 KI
PDB links: 17 PDB IDs match this monomer.
  Tab Delimited (TSV)   2D SDfile   Computed 3D by Vconf -m prep SDfile
Find this compound or compounds like it in BindingDB:
Activity Spreadsheet -- Enzyme Inhibition Constant Data from BindingDB
Found 2 hits for monomerid = 50327038
TargetBeta-hexosaminidase subunit alpha(Homo sapiens (Human))
East China University Of Science And Technology
Curated by ChEMBL
LigandPNGBDBM50327038((3aR,5R,6S,7R,7aR)-5-(hydroxymethyl)-2-methyl-5,6,...)
Affinity DataKi:  270nM. Assay description: Competitive inhibition of human beta-N-acetyl-D-hexosaminidase-A using 4-Methylumbelliferyl N-acetyl-beta-D-glucosaminide as substrate assessed as re...
TargetBeta-hexosaminidase subunit beta(Homo sapiens (Human))
East China University Of Science And Technology
Curated by ChEMBL
LigandPNGBDBM50327038((3aR,5R,6S,7R,7aR)-5-(hydroxymethyl)-2-methyl-5,6,...)
Affinity DataKi:  290nM. Assay description: Competitive inhibition of human beta-N-acetyl-D-hexosaminidase-B using 4-Methylumbelliferyl N-acetyl-beta-D-glucosaminide as substrate assessed as re...