BDBM50327139 (R)-methyl 2-(4-hydroxyphenyl)-2-((R)-piperidin-2-yl)acetate::CHEMBL1253698
SMILES COC(=O)[C@@H]([C@H]1CCCCN1)c1ccc(O)cc1
InChI Key InChIKey=XVXFNANJMMTNSO-CHWSQXEVSA-N
Data  2 IC50
  Tab Delimited (TSV)   2D SDfile   Computed 3D by Vconf -m prep SDfile
Find this compound or compounds like it in BindingDB:
Activity Spreadsheet -- Enzyme Inhibition Constant Data from BindingDB
Found 1 hit for monomerid = 50327139
TargetSodium-dependent dopamine transporter(Rattus norvegicus (rat))
Institute Of Technology
Curated by ChEMBL
LigandPNGBDBM50327139((R)-methyl 2-(4-hydroxyphenyl)-2-((R)-piperidin-2-...)
Affinity DataIC50:  98nM. Assay description: Displacement of [3H]WIN 35428 from Sprague-Dawley rat striatal tissue after 2 hrs by liquid scintillation counting
In DepthDetails ArticlePubMed