BDBM50327668 8-Bromo-11H-dibenzo[b,e]azepine::CHEMBL1255819
SMILES Brc1ccc2Cc3ccccc3N=Cc2c1
InChI Key InChIKey=NOVSJLUARMRDQL-UHFFFAOYSA-N
Data  1 EC50
  Tab Delimited (TSV)   2D SDfile   Computed 3D by Vconf -m prep SDfile
Find this compound or compounds like it in BindingDB:
Activity Spreadsheet -- Enzyme Inhibition Constant Data from BindingDB
Found 1 hit for monomerid = 50327668
TargetTransient receptor potential cation channel subfamily A member 1(Homo sapiens (Human))
Johnson & Johnson Pharmaceutical Research & Development
Curated by ChEMBL
LigandPNGBDBM50327668(8-Bromo-11H-dibenzo[b,e]azepine | CHEMBL1255819)
Affinity DataEC50:  33nM. Assay description: Agonist activity at human TRPA1 expressed in T-REx-HEK293 cells assessed as increase of intracellular calcium level by FDSS assay
In DepthDetails ArticlePubMed