BDBM50327671 11H-Dibenzo[b,e]azepine-10-carbonitrile hydrochloride::CHEMBL1256239
SMILES N#Cc1cccc2C=Nc3ccccc3Cc12
InChI Key InChIKey=VDSJOHLEATVHRK-UHFFFAOYSA-N
Data  1 EC50
  Tab Delimited (TSV)   2D SDfile   Computed 3D by Vconf -m prep SDfile
Find this compound or compounds like it in BindingDB:
Activity Spreadsheet -- Enzyme Inhibition Constant Data from BindingDB
Found 1 hit for monomerid = 50327671
TargetTransient receptor potential cation channel subfamily A member 1(Homo sapiens (Human))
Johnson & Johnson Pharmaceutical Research & Development
Curated by ChEMBL
LigandPNGBDBM50327671(11H-Dibenzo[b,e]azepine-10-carbonitrile hydrochlor...)
Affinity DataEC50:  1.60nM. Assay description: Agonist activity at human TRPA1 expressed in T-REx-HEK293 cells assessed as increase of intracellular calcium level by FDSS assay
In DepthDetails ArticlePubMed