BDBM50327877 (1R*,2R*,3S*,4R*,6R*)-2-Amino-6-phenethyl-bicyclo[2.2.1]-heptane-2,3-dicarboxylic Acid Trifluoroacetate::CHEMBL1258906
SMILES N[C@@]1(C2C[C@H](C[C@H]2CCc2ccccc2)[C@@H]1C(O)=O)C(O)=O
InChI Key InChIKey=NXAGPXNHRZPSRN-JQHNFKDESA-N
Data  1 IC50
  Tab Delimited (TSV)   2D SDfile   Computed 3D by Vconf -m prep SDfile
Find this compound or compounds like it in BindingDB:
Activity Spreadsheet -- Enzyme Inhibition Constant Data from BindingDB
Found 1 hit for monomerid = 50327877
TargetExcitatory amino acid transporter 2(Homo sapiens (Human))
University Of Berne
Curated by ChEMBL
LigandPNGBDBM50327877((1R*,2R*,3S*,4R*,6R*)-2-Amino-6-phenethyl-bicyclo[...)
Affinity DataIC50:  1.40E+3nM. Assay description: Inhibition of human GLT1 expressed in Xenopus laevis Oocytes assessed as reduction of [3H]-glutamate uptake after 10 mins by scintillation counting
In DepthDetails ArticlePubMed