BDBM50328327 1-(4-(hydroxymethyl)phenoxy)-3-(1-(5-phenylthieno[2,3-d]pyrimidin-4-yl)piperidin-4-ylamino)propan-2-ol::CHEMBL1258483
SMILES OCc1ccc(OCC(O)CNC2CCN(CC2)c2ncnc3scc(-c4ccccc4)c23)cc1
InChI Key InChIKey=WBXXCRJNZCCGHK-UHFFFAOYSA-N
Data  2 KI  1 IC50
  Tab Delimited (TSV)   2D SDfile   Computed 3D by Vconf -m prep SDfile
Find this compound or compounds like it in BindingDB:
Activity Spreadsheet -- Enzyme Inhibition Constant Data from BindingDB
Found 3 hits for monomerid = 50328327
TargetBeta-2 adrenergic receptor(Homo sapiens (Human))
4Sc
Curated by ChEMBL
LigandPNGBDBM50328327(1-(4-(hydroxymethyl)phenoxy)-3-(1-(5-phenylthieno[...)
Affinity DataKi:  93nM. Assay description: Displacement of [125I]-cyanopindolol from human adrenergic beta2 receptor expressed in CHO cells
In DepthDetails ArticlePubMed
TargetBeta-3 adrenergic receptor(Homo sapiens (Human))
4Sc
Curated by ChEMBL
LigandPNGBDBM50328327(1-(4-(hydroxymethyl)phenoxy)-3-(1-(5-phenylthieno[...)
Affinity DataKi:  290nM. Assay description: Displacement of [125I]-cyanopindolol from human adrenergic beta3 receptor expressed in CHO cells
In DepthDetails ArticlePubMed
TargetBeta-3 adrenergic receptor(Homo sapiens (Human))
4Sc
Curated by ChEMBL
LigandPNGBDBM50328327(1-(4-(hydroxymethyl)phenoxy)-3-(1-(5-phenylthieno[...)
Affinity DataIC50:  162nM. Assay description: Antagonist activity at human recombinant adrenergic beta3 receptor expressed in CHO cells assessed as inhibition of isoproterenol-induced cyclic AMP ...
In DepthDetails ArticlePubMed