BDBM50329476 (S)-N-(1-(3-(4-(3-aminopropylamino)butylamino)propylamino)-3-cyclohexyl-1-oxopropan-2-yl)biphenyl-4-carboxamide::CHEMBL1269125
SMILES NCCCNCCCCNCCCNC(=O)[C@H](CC1CCCCC1)NC(=O)c1ccc(cc1)-c1ccccc1
InChI Key InChIKey=YRTJBUGCGGXTRV-PMERELPUSA-N
Data  4 IC50
  Tab Delimited (TSV)   2D SDfile   Computed 3D by Vconf -m prep SDfile
Find this compound or compounds like it in BindingDB:
Activity Spreadsheet -- Enzyme Inhibition Constant Data from BindingDB
Found 4 hits for monomerid = 50329476
TargetMetabotropic glutamate receptor 1(Homo sapiens (Human))
University Of Copenhagen
Curated by ChEMBL
LigandPNGBDBM50329476((S)-N-(1-(3-(4-(3-aminopropylamino)butylamino)prop...)
Affinity DataIC50:  87nM. Assay description: Antagonist activity at GluR1 expressed in Xenopus laevis oocytes assessed as inhibition of glutamate-induced current at -60mV holding potential by tw...
In DepthDetails ArticlePubMed
TargetNeuronal acetylcholine receptor subunit alpha-4/beta-2(Homo sapiens (Human))
University Of Nottingham
Curated by ChEMBL
LigandPNGBDBM50329476((S)-N-(1-(3-(4-(3-aminopropylamino)butylamino)prop...)
Affinity DataIC50:  26nM. Assay description: Antagonist activity at alpha4beta2 nAChR (unknown origin) expressed in Xenopus laevis oocytes assessed as inhibition of Ach-induced channel activatio...
In DepthDetails ArticlePubMed
TargetNeuronal acetylcholine receptor subunit alpha-3/beta-4(Homo sapiens (Human))
University Of Nottingham
Curated by ChEMBL
LigandPNGBDBM50329476((S)-N-(1-(3-(4-(3-aminopropylamino)butylamino)prop...)
Affinity DataIC50:  2.80nM. Assay description: Antagonist activity at alpha3beta4 nAChR (unknown origin) expressed in Xenopus laevis oocytes assessed as inhibition of Ach-induced channel activatio...
In DepthDetails ArticlePubMed
TargetGlutamate receptor ionotropic, NMDA 1/2A(Homo sapiens (Human))
University Of Copenhagen
Curated by ChEMBL
LigandPNGBDBM50329476((S)-N-(1-(3-(4-(3-aminopropylamino)butylamino)prop...)
Affinity DataIC50:  1.45E+3nM. Assay description: Antagonist activity at NR1-1a/NR2A receptor expressed in Xenopus laevis oocytes assessed as inhibition of glutamate/glycine-induced current at -60mV ...
In DepthDetails ArticlePubMed