BDBM50331122 2-morpholino-7-(3-(trifluoromethyl)pyridin-2-yl)-N-(5-(trifluoromethyl)pyridin-2-yl)-6,7,8,9-tetrahydro-5H-pyrimido[5,4-d]azepin-4-amine::CHEMBL1290143::US9422293, 41::US9738649, Example 41
SMILES FC(F)(F)c1ccc(Nc2nc(nc3CCN(CCc23)c2ncccc2C(F)(F)F)N2CCOCC2)nc1
InChI Key InChIKey=WHAOMFOXCYOXDL-UHFFFAOYSA-N
Data  5 IC50
  Tab Delimited (TSV)   2D SDfile   Computed 3D by Vconf -m prep SDfile
Find this compound or compounds like it in BindingDB:
Activity Spreadsheet -- Enzyme Inhibition Constant Data from BindingDB
Found 5 hits for monomerid = 50331122
TargetTransient receptor potential cation channel subfamily V member 1(Homo sapiens (Human))
Janssen Pharmaceutica
US Patent
LigandPNGBDBM50331122(2-morpholino-7-(3-(trifluoromethyl)pyridin-2-yl)-N...)
Affinity DataIC50:  38nMT: 2°C. Assay description: HEK293 cells were transfected with human TRPV1 cloned in pcDNA3.1zeo(+) using the Effectene non-liposomal lipid based transfection kit (Qiagen) (hTRP...
In DepthDetails US Patent
TargetTransient receptor potential cation channel subfamily V member 1(Rattus norvegicus (rat))
Janssen Pharmaceutica
US Patent
LigandPNGBDBM50331122(2-morpholino-7-(3-(trifluoromethyl)pyridin-2-yl)-N...)
Affinity DataIC50:  49nMT: 2°C. Assay description: The assay was performed as described below, using HEK293 cells transfected with rat TRPV1 (rTRPV1/HEK293). These cells had a geneticin selection mark...
In DepthDetails US Patent
TargetTransient receptor potential cation channel subfamily V member 1(Rattus norvegicus (rat))
Janssen Pharmaceutica
US Patent
LigandPNGBDBM50331122(2-morpholino-7-(3-(trifluoromethyl)pyridin-2-yl)-N...)
Affinity DataIC50:  49nM. Assay description: The assay was performed as described above, using HEK293 cells transfected with rat TRPV1 (rTRPV1/HEK293). These cells had a geneticin selection mark...
In DepthDetails US Patent
TargetTransient receptor potential cation channel subfamily V member 1(Homo sapiens (Human))
Janssen Pharmaceutica
US Patent
LigandPNGBDBM50331122(2-morpholino-7-(3-(trifluoromethyl)pyridin-2-yl)-N...)
Affinity DataIC50:  38nM. Assay description: HEK293 cells were transfected with human TRPV1 cloned in pcDNA3.1zeo(+) using the Effectene non-liposomal lipid based transfection kit (Qiagen) (hTRP...
In DepthDetails US Patent
TargetTransient receptor potential cation channel subfamily V member 1(Homo sapiens (Human))
Janssen Pharmaceutica
US Patent
LigandPNGBDBM50331122(2-morpholino-7-(3-(trifluoromethyl)pyridin-2-yl)-N...)
Affinity DataIC50:  38nM. Assay description: Antagonist activity at human recombinant TRPV1 assessed as inhibition of capsaicin-induced in intracellular calcium levels by cell-based FLIPR assay
In DepthDetails ArticlePubMed