BDBM50331141 7-(3-(methylsulfonyl)pyridin-2-yl)-N-(4-(trifluoromethyl)phenyl)-6,7,8,9-tetrahydro-5H-pyrimido[5,4-d]azepin-4-amine::CHEMBL1290036::US9422293, 283::US9738649, Example 283
SMILES CS(=O)(=O)c1cccnc1N1CCc2ncnc(Nc3ccc(cc3)C(F)(F)F)c2CC1
InChI Key InChIKey=JVAQUSIYGAKOLL-UHFFFAOYSA-N
Data  5 IC50
  Tab Delimited (TSV)   2D SDfile   Computed 3D by Vconf -m prep SDfile
Find this compound or compounds like it in BindingDB:
Activity Spreadsheet -- Enzyme Inhibition Constant Data from BindingDB
Found 5 hits for monomerid = 50331141
TargetTransient receptor potential cation channel subfamily V member 1(Homo sapiens (Human))
Janssen Pharmaceutica
US Patent
LigandPNGBDBM50331141(7-(3-(methylsulfonyl)pyridin-2-yl)-N-(4-(trifluoro...)
Affinity DataIC50:  2.99E+3nMT: 2°C. Assay description: HEK293 cells were transfected with human TRPV1 cloned in pcDNA3.1zeo(+) using the Effectene non-liposomal lipid based transfection kit (Qiagen) (hTRP...
In DepthDetails US Patent
TargetTransient receptor potential cation channel subfamily V member 1(Rattus norvegicus (rat))
Janssen Pharmaceutica
US Patent
LigandPNGBDBM50331141(7-(3-(methylsulfonyl)pyridin-2-yl)-N-(4-(trifluoro...)
Affinity DataIC50:  8.52E+3nMT: 2°C. Assay description: The assay was performed as described below, using HEK293 cells transfected with rat TRPV1 (rTRPV1/HEK293). These cells had a geneticin selection mark...
In DepthDetails US Patent
TargetTransient receptor potential cation channel subfamily V member 1(Rattus norvegicus (rat))
Janssen Pharmaceutica
US Patent
LigandPNGBDBM50331141(7-(3-(methylsulfonyl)pyridin-2-yl)-N-(4-(trifluoro...)
Affinity DataIC50:  8.52E+3nM. Assay description: The assay was performed as described above, using HEK293 cells transfected with rat TRPV1 (rTRPV1/HEK293). These cells had a geneticin selection mark...
In DepthDetails US Patent
TargetTransient receptor potential cation channel subfamily V member 1(Homo sapiens (Human))
Janssen Pharmaceutica
US Patent
LigandPNGBDBM50331141(7-(3-(methylsulfonyl)pyridin-2-yl)-N-(4-(trifluoro...)
Affinity DataIC50:  2.99E+3nM. Assay description: HEK293 cells were transfected with human TRPV1 cloned in pcDNA3.1zeo(+) using the Effectene non-liposomal lipid based transfection kit (Qiagen) (hTRP...
In DepthDetails US Patent
TargetTransient receptor potential cation channel subfamily V member 1(Homo sapiens (Human))
Janssen Pharmaceutica
US Patent
LigandPNGBDBM50331141(7-(3-(methylsulfonyl)pyridin-2-yl)-N-(4-(trifluoro...)
Affinity DataIC50:  2.33E+3nM. Assay description: Antagonist activity at human recombinant TRPV1 assessed as inhibition of capsaicin-induced in intracellular calcium levels by cell-based FLIPR assay
In DepthDetails ArticlePubMed