BDBM50331142 2-(4-(4-(trifluoromethyl)phenylamino)-8,9-dihydro-5H-pyrimido[5,4-d]azepin-7(6H)-yl)pyridine-3-sulfonamide::CHEMBL1290145::US9422293, 302::US9738649, Example 302
SMILES NS(=O)(=O)c1cccnc1N1CCc2ncnc(Nc3ccc(cc3)C(F)(F)F)c2CC1
InChI Key InChIKey=FVNIYBXNZMVDAQ-UHFFFAOYSA-N
Data  5 IC50
  Tab Delimited (TSV)   2D SDfile   Computed 3D by Vconf -m prep SDfile
Find this compound or compounds like it in BindingDB:
Activity Spreadsheet -- Enzyme Inhibition Constant Data from BindingDB
Found 5 hits for monomerid = 50331142
TargetTransient receptor potential cation channel subfamily V member 1(Homo sapiens (Human))
Janssen Pharmaceutica
US Patent
LigandPNGBDBM50331142(2-(4-(4-(trifluoromethyl)phenylamino)-8,9-dihydro-...)
Affinity DataIC50:  840nMT: 2°C. Assay description: HEK293 cells were transfected with human TRPV1 cloned in pcDNA3.1zeo(+) using the Effectene non-liposomal lipid based transfection kit (Qiagen) (hTRP...
In DepthDetails US Patent
TargetTransient receptor potential cation channel subfamily V member 1(Rattus norvegicus (rat))
Janssen Pharmaceutica
US Patent
LigandPNGBDBM50331142(2-(4-(4-(trifluoromethyl)phenylamino)-8,9-dihydro-...)
Affinity DataIC50:  9.46E+3nMT: 2°C. Assay description: The assay was performed as described below, using HEK293 cells transfected with rat TRPV1 (rTRPV1/HEK293). These cells had a geneticin selection mark...
In DepthDetails US Patent
TargetTransient receptor potential cation channel subfamily V member 1(Rattus norvegicus (rat))
Janssen Pharmaceutica
US Patent
LigandPNGBDBM50331142(2-(4-(4-(trifluoromethyl)phenylamino)-8,9-dihydro-...)
Affinity DataIC50:  9.46E+3nM. Assay description: The assay was performed as described above, using HEK293 cells transfected with rat TRPV1 (rTRPV1/HEK293). These cells had a geneticin selection mark...
In DepthDetails US Patent
TargetTransient receptor potential cation channel subfamily V member 1(Homo sapiens (Human))
Janssen Pharmaceutica
US Patent
LigandPNGBDBM50331142(2-(4-(4-(trifluoromethyl)phenylamino)-8,9-dihydro-...)
Affinity DataIC50:  840nM. Assay description: HEK293 cells were transfected with human TRPV1 cloned in pcDNA3.1zeo(+) using the Effectene non-liposomal lipid based transfection kit (Qiagen) (hTRP...
In DepthDetails US Patent
TargetTransient receptor potential cation channel subfamily V member 1(Homo sapiens (Human))
Janssen Pharmaceutica
US Patent
LigandPNGBDBM50331142(2-(4-(4-(trifluoromethyl)phenylamino)-8,9-dihydro-...)
Affinity DataIC50:  2.78E+3nM. Assay description: Antagonist activity at human recombinant TRPV1 assessed as inhibition of capsaicin-induced in intracellular calcium levels by cell-based FLIPR assay
In DepthDetails ArticlePubMed