BDBM50331153 CHEMBL1290478::N-(4-tert-butylphenyl)-2-methyl-7-(3-(trifluoromethyl)pyridin-2-yl)-5,6,7,8-tetrahydropyrido[3,4-d]pyrimidin-4-amine
SMILES Cc1nc2CN(CCc2c(Nc2ccc(cc2)C(C)(C)C)n1)c1ncccc1C(F)(F)F
InChI Key InChIKey=URGNTDHUTIMFEL-UHFFFAOYSA-N
Data  1 IC50
  Tab Delimited (TSV)   2D SDfile   Computed 3D by Vconf -m prep SDfile
Find this compound or compounds like it in BindingDB:
Activity Spreadsheet -- Enzyme Inhibition Constant Data from BindingDB
Found 1 hit for monomerid = 50331153
TargetTransient receptor potential cation channel subfamily V member 1(Homo sapiens (Human))
Johnson & Johnson Pharmaceutical Research And Development
Curated by ChEMBL
LigandPNGBDBM50331153(CHEMBL1290478 | N-(4-tert-butylphenyl)-2-methyl-7-...)
Affinity DataIC50:  80nM. Assay description: Antagonist activity at human recombinant TRPV1 assessed as inhibition of capsaicin-induced in intracellular calcium levels by cell-based FLIPR assay
In DepthDetails ArticlePubMed