BDBM50331156 CHEMBL1290703::N-(4-tert-butylphenyl)-8-(3-(trifluoromethyl)pyridin-2-yl)-6,7,8,9-tetrahydro-5H-pyrimido[4,5-c]azepin-4-amine
SMILES CC(C)(C)c1ccc(Nc2ncnc3CN(CCCc23)c2ncccc2C(F)(F)F)cc1
InChI Key InChIKey=MDDVOITXGITVFA-UHFFFAOYSA-N
Data  1 IC50
  Tab Delimited (TSV)   2D SDfile   Computed 3D by Vconf -m prep SDfile
Find this compound or compounds like it in BindingDB:
Activity Spreadsheet -- Enzyme Inhibition Constant Data from BindingDB
Found 1 hit for monomerid = 50331156
TargetTransient receptor potential cation channel subfamily V member 1(Homo sapiens (Human))
Johnson & Johnson Pharmaceutical Research And Development
Curated by ChEMBL
LigandPNGBDBM50331156(CHEMBL1290703 | N-(4-tert-butylphenyl)-8-(3-(trifl...)
Affinity DataIC50:  2.04E+3nM. Assay description: Antagonist activity at human recombinant TRPV1 assessed as inhibition of capsaicin-induced in intracellular calcium levels by cell-based FLIPR assay
In DepthDetails ArticlePubMed