BDBM50331822 6-(cyclopropyl(1-methylpiperidin-4-yl)amino)-9-fluorobenzo[c][1,6]naphthyridin-1(2H)-one::CHEMBL1290534
SMILES CN1CCC(CC1)N(C1CC1)c1nc2cc[nH]c(=O)c2c2cc(F)ccc12
InChI Key InChIKey=DKLHZNZQFYSDTE-UHFFFAOYSA-N
Data  1 IC50
  Tab Delimited (TSV)   2D SDfile   Computed 3D by Vconf -m prep SDfile
Find this compound or compounds like it in BindingDB:
Activity Spreadsheet -- Enzyme Inhibition Constant Data from BindingDB
Found 1 hit for monomerid = 50331822
TargetTyrosine-protein kinase JAK2(Homo sapiens (Human))
Merck
Curated by ChEMBL
LigandPNGBDBM50331822(6-(cyclopropyl(1-methylpiperidin-4-yl)amino)-9-flu...)
Affinity DataIC50:  540nM. Assay description: Inhibition of JAK2 in cell-free system
In DepthDetails ArticlePubMed