BDBM50331826 9-fluoro-6-((7R)-1,6,6-trimethylbicyclo[3.1.1]heptan-7-ylamino)benzo[c][1,6]naphthyridin-1(2H)-one::CHEMBL1290768
SMILES CC1(C)C2CCCC1(C)[C@@H]2Nc1nc2cc[nH]c(=O)c2c2cc(F)ccc12
InChI Key InChIKey=FFSCPZBJYXHNHZ-GXPWMBGSSA-N
Data  1 IC50
  Tab Delimited (TSV)   2D SDfile   Computed 3D by Vconf -m prep SDfile
Find this compound or compounds like it in BindingDB:
Activity Spreadsheet -- Enzyme Inhibition Constant Data from BindingDB
Found 1 hit for monomerid = 50331826
TargetTyrosine-protein kinase JAK2(Homo sapiens (Human))
Merck
Curated by ChEMBL
LigandPNGBDBM50331826(9-fluoro-6-((7R)-1,6,6-trimethylbicyclo[3.1.1]hept...)
Affinity DataIC50:  200nM. Assay description: Inhibition of JAK2 in cell-free system
In DepthDetails ArticlePubMed