BDBM50331831 (S)-9-fluoro-6-(1,1,1-trifluoro-3-methylbutan-2-ylamino)benzo[c][1,6]naphthyridin-1(2H)-one::CHEMBL1289216
SMILES CC(C)[C@H](Nc1nc2cc[nH]c(=O)c2c2cc(F)ccc12)C(F)(F)F
InChI Key InChIKey=SDYVZQPJOBQDEW-AWEZNQCLSA-N
Data  1 IC50
  Tab Delimited (TSV)   2D SDfile   Computed 3D by Vconf -m prep SDfile
Find this compound or compounds like it in BindingDB:
Activity Spreadsheet -- Enzyme Inhibition Constant Data from BindingDB
Found 1 hit for monomerid = 50331831
TargetTyrosine-protein kinase JAK2(Homo sapiens (Human))
Merck
Curated by ChEMBL
LigandPNGBDBM50331831((S)-9-fluoro-6-(1,1,1-trifluoro-3-methylbutan-2-yl...)
Affinity DataIC50:  55nM. Assay description: Inhibition of JAK2 in cell-free system
In DepthDetails ArticlePubMed