BDBM50331975 1-(4-(2-chloro-4-fluorophenyl)piperazin-1-yl)-2-(pyridin-4-ylmethoxy)ethanone::CHEMBL1289113
SMILES Fc1ccc(N2CCN(CC2)C(=O)COCc2ccncc2)c(Cl)c1
InChI Key InChIKey=XNOMHUDLVRWWLV-UHFFFAOYSA-N
Data  1 KI  2 EC50
  Tab Delimited (TSV)   2D SDfile   Computed 3D by Vconf -m prep SDfile
Find this compound or compounds like it in BindingDB:
Activity Spreadsheet -- Enzyme Inhibition Constant Data from BindingDB
Found 3 hits for monomerid = 50331975
TargetMetabotropic glutamate receptor 5(Homo sapiens (Human))
Astrazeneca Pharmaceuticals
Curated by ChEMBL
LigandPNGBDBM50331975(1-(4-(2-chloro-4-fluorophenyl)piperazin-1-yl)-2-(p...)
Affinity DataKi:  2.37E+3nM. Assay description: Displacement of [3H]-MPEP from human mGluR5
In DepthDetails ArticlePubMed
TargetMetabotropic glutamate receptor 5(Homo sapiens (Human))
Astrazeneca Pharmaceuticals
Curated by ChEMBL
LigandPNGBDBM50331975(1-(4-(2-chloro-4-fluorophenyl)piperazin-1-yl)-2-(p...)
Affinity DataEC50:  550nM. Assay description: Positive allosteric modulation of human mGluR5 over-expressed in HEK293 cells
In DepthDetails ArticlePubMed
TargetMetabotropic glutamate receptor 5(Homo sapiens (Human))
Astrazeneca Pharmaceuticals
Curated by ChEMBL
LigandPNGBDBM50331975(1-(4-(2-chloro-4-fluorophenyl)piperazin-1-yl)-2-(p...)
Affinity DataEC50:  550nM. Assay description: Positive allosteric modulation of human mGluR5 expressed in HEK293 cells assessed as Ca2+ influx by FLIPR assay
In DepthDetails ArticlePubMed