BDBM50332817 (6R,8R,9S,10S,13S,14S)-6-hydroxy-10-(hydroxymethyl)-13-methyl-2,3,7,8,9,10,11,12,13,14,15,16-dodecahydro-1H-cyclopenta[a]phenanthren-17(6H)-one::CHEMBL1630267
SMILES C[C@]12CC[C@H]3[C@@H](C[C@@H](O)C4=CCCC[C@]34CO)[C@@H]1CCC2=O
InChI Key InChIKey=FITTWLFIFVRTBR-ZEHJPDPISA-N
Data  1 IC50
  Tab Delimited (TSV)   2D SDfile   Computed 3D by Vconf -m prep SDfile
Find this compound or compounds like it in BindingDB:
Activity Spreadsheet -- Enzyme Inhibition Constant Data from BindingDB
Found 1 hit for monomerid = 50332817
TargetAromatase(Homo sapiens (Human))
Tianjin University Of Science And Technology
Curated by ChEMBL
LigandPNGBDBM50332817((6R,8R,9S,10S,13S,14S)-6-hydroxy-10-(hydroxymethyl...)
Affinity DataIC50:  940nM. Assay description: Inhibition of human placental aromataseChecked by Author
In DepthDetails ArticlePubMed