BDBM50332819 (8R,9S,10S,13S,14S)-10,13-dimethyl-17-oxo-2,3,4,7,8,9,10,11,12,13,14,15,16,17-tetradecahydro-1H-cyclopenta[alpha]phenanthren-4-yl acetate::CHEMBL1630269
SMILES CC(=O)OC1CCC[C@@]2(C)[C@H]3CC[C@@]4(C)[C@@H](CCC4=O)[C@@H]3CC=C12
InChI Key InChIKey=WJINZNWBMZDWPK-JNRYQWNNSA-N
Data  1 IC50
  Tab Delimited (TSV)   2D SDfile   Computed 3D by Vconf -m prep SDfile
Find this compound or compounds like it in BindingDB:
Activity Spreadsheet -- Enzyme Inhibition Constant Data from BindingDB
Found 1 hit for monomerid = 50332819
TargetAromatase(Homo sapiens (Human))
Tianjin University Of Science And Technology
Curated by ChEMBL
LigandPNGBDBM50332819((8R,9S,10S,13S,14S)-10,13-dimethyl-17-oxo-2,3,4,7,...)
Affinity DataIC50:  700nM. Assay description: Inhibition of human placental aromataseChecked by Author
In DepthDetails ArticlePubMed