BDBM50332825 (4S,8R,9S,10S,13S,14S)-10-(hydroxymethyl)-4-methoxy-13-methyl-3,4,7,8,9,10,11,12,13,14,15,16-dodecahydro-1H-cyclopenta[alpha]phenanthren-17(2H)-one::CHEMBL1630275
SMILES CO[C@H]1CCC[C@]2(CO)[C@H]3CC[C@@]4(C)[C@@H](CCC4=O)[C@@H]3CC=C12
InChI Key InChIKey=XYTIMWXLVRWAHO-FHSQRROHSA-N
Data  1 IC50
  Tab Delimited (TSV)   2D SDfile   Computed 3D by Vconf -m prep SDfile
Find this compound or compounds like it in BindingDB:
Activity Spreadsheet -- Enzyme Inhibition Constant Data from BindingDB
Found 1 hit for monomerid = 50332825
TargetAromatase(Homo sapiens (Human))
Tianjin University Of Science And Technology
Curated by ChEMBL
LigandPNGBDBM50332825((4S,8R,9S,10S,13S,14S)-10-(hydroxymethyl)-4-methox...)
Affinity DataIC50:  1.50E+5nM. Assay description: Inhibition of human placental aromataseChecked by Author
In DepthDetails ArticlePubMed