BDBM50333932 CHEMBL1644421::[(2R,6R,10S,15S,17R)-13-benzyl-6-hydroxy-4,17-dimethyl-5-oxo-15-(prop-1-en-2-yl)-12,14,18-trioxapentacyclo[11.4.1.0^{1,10}.0^{2,6}.0^{11,15}]octadeca-3,8-dien-8-yl]methyl 2-(4-amino-3-chloro-5-methoxyphenyl)acetate
SMILES COc1cc(CC(=O)OCC2=C[C@H]3C4OC5(Cc6ccccc6)O[C@@]4(C[C@@H](C)C3(O5)[C@@H]3C=C(C)C(=O)[C@@]3(O)C2)C(C)=C)cc(Cl)c1N
InChI Key InChIKey=KDZNVUITNIZHCQ-ASPPJSJRSA-N
Data  1 KI
  Tab Delimited (TSV)   2D SDfile   Computed 3D by Vconf -m prep SDfile
Find this compound or compounds like it in BindingDB:
Activity Spreadsheet -- Enzyme Inhibition Constant Data from BindingDB
Found 1 hit for monomerid = 50333932
TargetTransient receptor potential cation channel subfamily V member 1(Rattus norvegicus (rat))
Seoul National University
Curated by ChEMBL
LigandPNGBDBM50333932(CHEMBL1644421 | [(2R,6R,10S,15S,17R)-13-benzyl-6-h...)
Affinity DataKi:  0.850nM. Assay description: Displacement of [3H]RTX from rat TRV1 expressed in CHO cells by competitive binding assay
In DepthDetails ArticlePubMed