BDBM50334444 (R)-2-ethyl-7-(quinuclidin-3-yl)-7,8-dihydropyrazolo[3,4,5-de]isoquinolin-6(2H)-one::CHEMBL1643886::US8501729, 14
SMILES CCn1[nH]c2cn([C@H]3CN4CCC3CC4)c(=O)c3cccc1c23
InChI Key InChIKey=UCBSZTBOXRRYMN-INIZCTEOSA-N
Data  2 KI
  Tab Delimited (TSV)   2D SDfile   Computed 3D by Vconf -m prep SDfile
Find this compound or compounds like it in BindingDB:
Activity Spreadsheet -- Enzyme Inhibition Constant Data from BindingDB
Found 2 hits for monomerid = 50334444
Target5-hydroxytryptamine receptor 3A(Homo sapiens (Human))
Amri
Curated by ChEMBL
LigandPNGBDBM50334444((R)-2-ethyl-7-(quinuclidin-3-yl)-7,8-dihydropyrazo...)
Affinity DataKi:  2nM. Assay description: Binding affinity to human 5HT3A receptor
In DepthDetails ArticlePubMed
Target5-hydroxytryptamine receptor 3A(Homo sapiens (Human))
Amri
Curated by ChEMBL
LigandPNGBDBM50334444((R)-2-ethyl-7-(quinuclidin-3-yl)-7,8-dihydropyrazo...)
Affinity DataKi:  2nMpH: 7.5Assay Description:The relative affinity of the various compounds for the human 5-HT3 receptor was measured in a radioligand binding assay, using a scintillation proxim...
In DepthDetails US Patent