BDBM50334899 CHEMBL1643256::N-tert-butyl-3-(1-methyl-1H-pyrazol-4-yl)-5-(piperidin-3-yl)pyrazolo[1,5-a]pyrimidin-7-amine
SMILES Cn1cc(cn1)-c1cnn2c(NC(C)(C)C)cc(nc12)C1CCCNC1
InChI Key InChIKey=QOXFISGIIGUASU-UHFFFAOYSA-N
Data  2 IC50
  Tab Delimited (TSV)   2D SDfile   Computed 3D by Vconf -m prep SDfile
Find this compound or compounds like it in BindingDB:
Activity Spreadsheet -- Enzyme Inhibition Constant Data from BindingDB
Found 2 hits for monomerid = 50334899
TargetCyclin-A1/Cyclin-A2/Cyclin-dependent kinase 2(Homo sapiens (Human))
Merck Research Laboratories
Curated by ChEMBL
LigandPNGBDBM50334899(CHEMBL1643256 | N-tert-butyl-3-(1-methyl-1H-pyrazo...)
Affinity DataIC50: >5.00E+4nM. Assay description: Inhibition of CDK2/cyclin A
In DepthDetails ArticlePubMed
TargetSerine/threonine-protein kinase Chk1(Homo sapiens (Human))
Merck Research Laboratories
Curated by ChEMBL
LigandPNGBDBM50334899(CHEMBL1643256 | N-tert-butyl-3-(1-methyl-1H-pyrazo...)
Affinity DataIC50:  5.00E+3nM. Assay description: Inhibition of recombinant His-CHK1 expressed in baculovirus after 2 hrs by scintillation proximity assay
In DepthDetails ArticlePubMed