BDBM50334953 24-benzyl-3alpha,7beta-hydroxy-5beta-cholanamide::CHEMBL1649690
SMILES C[C@H](CCC(=O)NCc1ccccc1)[C@H]1CC[C@H]2[C@@H]3[C@@H](O)C[C@@H]4C[C@H](O)CC[C@]4(C)[C@H]3CC[C@]12C
InChI Key InChIKey=YJXVFRWCHMYWTD-FQEVQUCMSA-N
Data  1 EC50
  Tab Delimited (TSV)   2D SDfile   Computed 3D by Vconf -m prep SDfile
Find this compound or compounds like it in BindingDB:
Activity Spreadsheet -- Enzyme Inhibition Constant Data from BindingDB
Found 1 hit for monomerid = 50334953
TargetGlucocorticoid receptor(Homo sapiens (Human))
Trinity College Dublin
Curated by ChEMBL
LigandPNGBDBM50334953(24-benzyl-3alpha,7beta-hydroxy-5beta-cholanamide |...)
Affinity DataEC50:  1.10E+5nM. Assay description: Modulation of glucocorticoid receptor in human SKGT4 cells assessed as receptor translocation from cytoplasm to nucleus after 4 hrs by Hoechst staini...
In DepthDetails ArticlePubMed