BDBM50334959 (S)-2-((3R,5S,7S,8R,9S,10S,13S,14S,17R)-3,7-dihydroxy-10,13-dimethylhexadecahydro-1H-cyclopenta[a]phenanthren-17-yl)propanoic acid::CHEMBL1254991
SMILES C[C@@H]([C@H]1CC[C@H]2[C@@H]3[C@@H](O)C[C@@H]4C[C@H](O)CC[C@]4(C)[C@H]3CC[C@]12C)C(O)=O
InChI Key InChIKey=WQUYUZJNAIWNRJ-ONVGLGCPSA-N
Data  2 EC50
  Tab Delimited (TSV)   2D SDfile   Computed 3D by Vconf -m prep SDfile
Find this compound or compounds like it in BindingDB:
Activity Spreadsheet -- Enzyme Inhibition Constant Data from BindingDB
Found 2 hits for monomerid = 50334959
TargetGlucocorticoid receptor(Homo sapiens (Human))
Trinity College Dublin
Curated by ChEMBL
LigandPNGBDBM50334959((S)-2-((3R,5S,7S,8R,9S,10S,13S,14S,17R)-3,7-dihydr...)
Affinity DataEC50:  9.97E+4nM. Assay description: Modulation of glucocorticoid receptor in human SKGT4 cells assessed as receptor translocation from cytoplasm to nucleus after 4 hrs by Hoechst staini...
In DepthDetails ArticlePubMed
TargetG-protein coupled bile acid receptor 1(Homo sapiens (Human))
Centre National de la Recherche Scientifique/INSERM/ULP
Curated by ChEMBL
LigandPNGBDBM50334959((S)-2-((3R,5S,7S,8R,9S,10S,13S,14S,17R)-3,7-dihydr...)
Affinity DataEC50: >3.16E+5nM. Assay description: Agonist activity at human TGR5 expressed in CHO cells by luciferase assay
In DepthDetails ArticlePubMed