BDBM50335240 4-Chloro-3'-((2-cyclopentyl-1-oxo-1,2,3,4-tetrahydroisoquinolin-6-yloxy)methyl)biphenyl-3-carboxylic Acid::CHEMBL1651221
SMILES OC(=O)c1cc(ccc1Cl)-c1cccc(COc2ccc3C(=O)N(CCc3c2)C2CCCC2)c1
InChI Key InChIKey=OAQBFIUKZFPSMN-UHFFFAOYSA-N
Data  1 EC50
  Tab Delimited (TSV)   2D SDfile   Computed 3D by Vconf -m prep SDfile
Find this compound or compounds like it in BindingDB:
Activity Spreadsheet -- Enzyme Inhibition Constant Data from BindingDB
Found 1 hit for monomerid = 50335240
TargetMetabotropic glutamate receptor 2(Homo sapiens (Human))
Sanford-Burnham Medical Research Institute
Curated by ChEMBL
LigandPNGBDBM50335240(4-Chloro-3'-((2-cyclopentyl-1-oxo-1,2,3,4-tetrahyd...)
Affinity DataEC50:  300nM. Assay description: Positive allosteric modulation of rat mGluR2 expressed in HEK-293 cells assessed as thaillium flux through GIRK channels
In DepthDetails ArticlePubMed