BDBM50335252 4-Chloro-3'-((2-isopropyl-1-oxoisoindolin-5-yloxy)methyl)biphenyl-3-carboxylic Acid::CHEMBL1651209
SMILES CC(C)N1Cc2cc(OCc3cccc(c3)-c3ccc(Cl)c(c3)C(O)=O)ccc2C1=O
InChI Key InChIKey=IPHOWNGWSDCVGP-UHFFFAOYSA-N
Data  1 EC50
  Tab Delimited (TSV)   2D SDfile   Computed 3D by Vconf -m prep SDfile
Find this compound or compounds like it in BindingDB:
Activity Spreadsheet -- Enzyme Inhibition Constant Data from BindingDB
Found 1 hit for monomerid = 50335252
TargetMetabotropic glutamate receptor 2(Homo sapiens (Human))
Sanford-Burnham Medical Research Institute
Curated by ChEMBL
LigandPNGBDBM50335252(4-Chloro-3'-((2-isopropyl-1-oxoisoindolin-5-yloxy)...)
Affinity DataEC50:  70nM. Assay description: Positive allosteric modulation of rat mGluR2 expressed in HEK-293 cells assessed as thaillium flux through GIRK channels
In DepthDetails ArticlePubMed