BDBM50335273 (R)-2-{3-[(4-adamantan-1-yl-benzoylamino)-methyl]-4-propoxy-benzyl}-butyric acid::CHEMBL272137
SMILES CCCOc1ccc(C[C@@H](CC)C(O)=O)cc1CNC(=O)c1ccc(cc1)C12CC3CC(CC(C3)C1)C2
InChI Key InChIKey=GUFHDBFHNDUDJA-MRWIZJNUSA-N
Data  9 EC50
  Tab Delimited (TSV)   2D SDfile   Computed 3D by Vconf -m prep SDfile
Find this compound or compounds like it in BindingDB:
Activity Spreadsheet -- Enzyme Inhibition Constant Data from BindingDB
Found 9 hits for monomerid = 50335273
TargetPeroxisome proliferator-activated receptor gamma(Homo sapiens (Human))
Okayama University
Curated by ChEMBL
LigandPNGBDBM50335273((R)-2-{3-[(4-adamantan-1-yl-benzoylamino)-methyl]-...)
Affinity DataEC50:  83nM. Assay description: Transactivation of human PPARgamma expressed in human HEK293 cells after 16 to 20 hrs by dual luciferase beta-galactosidase reporter gene assay
In DepthDetails ArticlePubMed
TargetPeroxisome proliferator-activated receptor delta(Homo sapiens (Human))
Okayama University
Curated by ChEMBL
LigandPNGBDBM50335273((R)-2-{3-[(4-adamantan-1-yl-benzoylamino)-methyl]-...)
Affinity DataEC50:  870nM. Assay description: Transactivation of human PPARdelta expressed in human HEK293 cells after 16 to 20 hrs by dual luciferase beta-galactosidase reporter gene assay
In DepthDetails ArticlePubMed
TargetPeroxisome proliferator-activated receptor alpha(Homo sapiens (Human))
Okayama University
Curated by ChEMBL
LigandPNGBDBM50335273((R)-2-{3-[(4-adamantan-1-yl-benzoylamino)-methyl]-...)
Affinity DataEC50:  500nM. Assay description: Transactivation of human PPARalpha expressed in human HEK293 cells after 16 to 20 hrs by dual luciferase beta-galactosidase reporter gene assay
In DepthDetails ArticlePubMed
TargetPeroxisome proliferator-activated receptor alpha(Homo sapiens (Human))
Okayama University
Curated by ChEMBL
LigandPNGBDBM50335273((R)-2-{3-[(4-adamantan-1-yl-benzoylamino)-methyl]-...)
Affinity DataEC50:  500nM. Assay description: Agonist activity at human recombinant PPARalpha in HEK293 cells by GAL4 transactivation assay
In DepthDetails ArticlePubMed
TargetPeroxisome proliferator-activated receptor gamma(Homo sapiens (Human))
Okayama University
Curated by ChEMBL
LigandPNGBDBM50335273((R)-2-{3-[(4-adamantan-1-yl-benzoylamino)-methyl]-...)
Affinity DataEC50:  83nM. Assay description: Transactivation of Gal4-fused human PPARgamma expressed in HEK293 cells after 16 to 20 hrs by luciferase reporter gene assay
In DepthDetails ArticlePubMed
TargetPeroxisome proliferator-activated receptor gamma(Homo sapiens (Human))
Okayama University
Curated by ChEMBL
LigandPNGBDBM50335273((R)-2-{3-[(4-adamantan-1-yl-benzoylamino)-methyl]-...)
Affinity DataEC50:  83nM. Assay description: Agonist activity at human recombinant PPARgamma in HEK293 cells by GAL4 transactivation assay
In DepthDetails ArticlePubMed
TargetPeroxisome proliferator-activated receptor alpha(Homo sapiens (Human))
Okayama University
Curated by ChEMBL
LigandPNGBDBM50335273((R)-2-{3-[(4-adamantan-1-yl-benzoylamino)-methyl]-...)
Affinity DataEC50:  500nM. Assay description: Transactivation of Gal4-fused human PPARalpha expressed in HEK293 cells after 16 to 20 hrs by luciferase reporter gene assay
In DepthDetails ArticlePubMed
TargetPeroxisome proliferator-activated receptor delta(Homo sapiens (Human))
Okayama University
Curated by ChEMBL
LigandPNGBDBM50335273((R)-2-{3-[(4-adamantan-1-yl-benzoylamino)-methyl]-...)
Affinity DataEC50:  870nM. Assay description: Transactivation of Gal4-fused human PPARdelta expressed in HEK293 cells after 16 to 20 hrs by luciferase reporter gene assay
In DepthDetails ArticlePubMed
TargetPeroxisome proliferator-activated receptor delta(Homo sapiens (Human))
Okayama University
Curated by ChEMBL
LigandPNGBDBM50335273((R)-2-{3-[(4-adamantan-1-yl-benzoylamino)-methyl]-...)
Affinity DataEC50:  870nM. Assay description: Agonist activity at human recombinant PPARdelta in HEK293 cells by GAL4 transactivation assay
In DepthDetails ArticlePubMed