BDBM50335578 5'''-episilvestrol::CHEMBL1651030
SMILES CO[C@H]1OC[C@@H](O[C@H]1Oc1cc2O[C@]3([C@@H]([C@H]([C@@H](O)[C@@]3(O)c2c(OC)c1)C(=O)OC)c1ccccc1)c1ccc(OC)cc1)[C@H](O)CO
InChI Key InChIKey=GVKXFVCXBFGBCD-GTDORJALSA-N
Data  1 IC50
  Tab Delimited (TSV)   2D SDfile   Computed 3D by Vconf -m prep SDfile
Find this compound or compounds like it in BindingDB:
Activity Spreadsheet -- Enzyme Inhibition Constant Data from BindingDB
Found 1 hit for monomerid = 50335578
TargetTranscription factor p65(Homo sapiens (Human))
The Ohio State University
Curated by ChEMBL
LigandPNGBDBM50335578(5'''-episilvestrol | CHEMBL1651030)
Affinity DataIC50: >2.00E+4nM. Assay description: Inhibition of NFkappaB p65 isolated from nuclear extract of human HeLa cells assessed as blockade of binding to biotinylated consesus sequence by che...
In DepthDetails ArticlePubMed