BDBM50335596 (+)-oxypeucedanin::CHEMBL1651087
SMILES CC1(C)O[C@H]1COc1cc(=O)oc2cc3occc3cc12
InChI Key InChIKey=NUCBCBCPICFGMZ-AWEZNQCLSA-N
Data  1 IC50
  Tab Delimited (TSV)   2D SDfile   Computed 3D by Vconf -m prep SDfile
Find this compound or compounds like it in BindingDB:
Activity Spreadsheet -- Enzyme Inhibition Constant Data from BindingDB
Found 1 hit for monomerid = 50335596
TargetCholinesterase(Equus caballus (Horse))
Ramkhamhaeng University
Curated by ChEMBL
LigandPNGBDBM50335596((+)-oxypeucedanin | CHEMBL1651087)
Affinity DataIC50:  6.40E+4nM. Assay description: Inhibition of horse serum BChE after 2 mins by Ellman's reaction
In DepthDetails ArticlePubMed