BDBM50336746 4-[4-(2,4-Dioxothiazolidin-5-ylidenemethyl)naphthalen-1-yloxy]-2-trifluoromethylbenzonitrile::CHEMBL1671989
SMILES OC1=NC(=O)C(S1)=Cc1ccc(Oc2ccc(C#N)c(c2)C(F)(F)F)c2ccccc12
InChI Key InChIKey=CIRQREHSLLSRKH-UHFFFAOYSA-N
Data  1 IC50
  Tab Delimited (TSV)   2D SDfile   Computed 3D by Vconf -m prep SDfile
Find this compound or compounds like it in BindingDB:
Activity Spreadsheet -- Enzyme Inhibition Constant Data from BindingDB
Found 1 hit for monomerid = 50336746
TargetSteroid hormone receptor ERR1(Homo sapiens (Human))
Johnson & Johnson Pharmaceutical Research And Development
Curated by ChEMBL
LigandPNGBDBM50336746(4-[4-(2,4-Dioxothiazolidin-5-ylidenemethyl)naphtha...)
Affinity DataIC50:  2.60E+3nM. Assay description: Agonist activity at 6his-tagged ERRalpha LBD assessed as recruitment of GST-labeled coactivator Scr2 by TR-FRET assay
In DepthDetails ArticlePubMed