BDBM50337198 (S)-3-(((S)-1-((5-(Benzylcarbamoyl)-4'-carbamoyl-[1,1'-biphenyl]-3-yl)amino)-4-methyl-1-oxopentan-2-yl)amino)-2-(4-cyanobenzamido)-3-oxopropyl)phenyl dihydrogen phosphate::CHEMBL1681824
SMILES CC(C)C[C@H](NC(=O)[C@H](Cc1ccc(OP(O)(O)=O)cc1)NC(=O)c1ccc(cc1)C#N)C(=O)Nc1cc(cc(c1)-c1ccc(cc1)C(N)=O)C(=O)NCc1ccccc1
InChI Key InChIKey=PEXNGCNKHRPGFE-YDAXCOIMSA-N
Data  2 KI  1 IC50  1 Kd
  Tab Delimited (TSV)   2D SDfile   Computed 3D by Vconf -m prep SDfile
Find this compound or compounds like it in BindingDB:
Activity Spreadsheet -- Enzyme Inhibition Constant Data from BindingDB
Found 4 hits for monomerid = 50337198
TargetSignal transducer and activator of transcription 3(Mus musculus (mouse))
University Of Toronto
Curated by ChEMBL
LigandPNGBDBM50337198((S)-3-(((S)-1-((5-(Benzylcarbamoyl)-4'-carbamoyl-[...)
Affinity DataKi:  9.00E+3nM. Assay description: Displacement of 5-carboxyfluorescein-GpYLPQTV-NH2 from mouse recombinant His-tagged STAT3-SH2 domain expressed in Escherichia coli BL21 (DE3) by fluo...
In DepthDetails ArticlePubMed
TargetSignal transducer and activator of transcription 1(Mus musculus)
University Of Toronto
Curated by ChEMBL
LigandPNGBDBM50337198((S)-3-(((S)-1-((5-(Benzylcarbamoyl)-4'-carbamoyl-[...)
Affinity DataKi:  1.65E+4nM. Assay description: Displacement of 5-carboxyfluorescein-GpYDKPHVL-NH2 from mouse recombinant His-tagged STAT1-SH2 domain expressed in Escherichia coli BL21 (DE3) by flu...
In DepthDetails ArticlePubMed
TargetSignal transducer and activator of transcription 3(Mus musculus (mouse))
University Of Toronto
Curated by ChEMBL
LigandPNGBDBM50337198((S)-3-(((S)-1-((5-(Benzylcarbamoyl)-4'-carbamoyl-[...)
Affinity DataKd:  205nM. Assay description: Inhibition of mouse recombinant SH2 domain of His-tagged full-length STAT3 by surface plasmon resonance assay
In DepthDetails ArticlePubMed
TargetSignal transducer and activator of transcription 3(Mus musculus (mouse))
University Of Toronto
Curated by ChEMBL
LigandPNGBDBM50337198((S)-3-(((S)-1-((5-(Benzylcarbamoyl)-4'-carbamoyl-[...)
Affinity DataIC50:  5.00E+3nM. Assay description: Inhibition of STAT3 dimerization in mouse NIH3T3 cells expressing v-Src assessed as disruption of STAT3-STAT3: DNA complexation in nucleus after 30 m...
In DepthDetails ArticlePubMed