BDBM50337476 CHEMBL1682784::N-(5-chloro-2-(1H-tetrazol-1-yl)benzyl)-3-(cyclohexylamino)-5-methylbenzamide
SMILES Cc1cc(NC2CCCCC2)cc(c1)C(=O)NCc1cc(Cl)ccc1-n1cnnn1
InChI Key InChIKey=UAOUFXRAVCETFJ-UHFFFAOYSA-N
Data  1 KI
  Tab Delimited (TSV)   2D SDfile   Computed 3D by Vconf -m prep SDfile
Find this compound or compounds like it in BindingDB:
Activity Spreadsheet -- Enzyme Inhibition Constant Data from BindingDB
Found 1 hit for monomerid = 50337476
TargetProthrombin(Homo sapiens (Human))
Merck Research Laboratories
Curated by ChEMBL
LigandPNGBDBM50337476(CHEMBL1682784 | N-(5-chloro-2-(1H-tetrazol-1-yl)be...)
Affinity DataKi:  9.60nM. Assay description: Inhibition of thrombin
In DepthDetails ArticlePubMed