BDBM50337746 4-(((1R)-7,7-dimethyl-2-oxobicyclo[2.2.1]heptan-1-yl)methylsulfonamido)benzenesulfonamide::CHEMBL1683466
SMILES CC1(C)C2CC[C@]1(CS(=O)(=O)Nc1ccc(cc1)S(N)(=O)=O)C(=O)C2
InChI Key InChIKey=FSXHELJSQFRYHW-NBFOKTCDSA-N
Data  4 KI
  Tab Delimited (TSV)   2D SDfile   Computed 3D by Vconf -m prep SDfile
Find this compound or compounds like it in BindingDB:
Activity Spreadsheet -- Enzyme Inhibition Constant Data from BindingDB
Found 4 hits for monomerid = 50337746
TargetCarbonic anhydrase 5A, mitochondrial(Homo sapiens (Human))
Universit£
Curated by ChEMBL
LigandPNGBDBM50337746(4-(((1R)-7,7-dimethyl-2-oxobicyclo[2.2.1]heptan-1-...)
Affinity DataKi:  17.1nM. Assay description: Inhibition of human recombinant CA5A mitochondrial isoform by stopped-flow CO2 hydration assay
In DepthDetails ArticlePubMed
TargetCarbonic anhydrase 5B, mitochondrial(Homo sapiens (Human))
Universit£
Curated by ChEMBL
LigandPNGBDBM50337746(4-(((1R)-7,7-dimethyl-2-oxobicyclo[2.2.1]heptan-1-...)
Affinity DataKi:  26.4nM. Assay description: Inhibition of human recombinant CA5B mitochondrial isoform by stopped-flow CO2 hydration assay
In DepthDetails ArticlePubMed
TargetCarbonic anhydrase 2(Homo sapiens (Human))
Universit£
Curated by ChEMBL
LigandPNGBDBM50337746(4-(((1R)-7,7-dimethyl-2-oxobicyclo[2.2.1]heptan-1-...)
Affinity DataKi:  1.21E+3nM. Assay description: Inhibition of human recombinant CA2 cytosolic isoform by stopped-flow CO2 hydration assay
In DepthDetails ArticlePubMed
TargetCarbonic anhydrase 1(Homo sapiens (Human))
Universit£
Curated by ChEMBL
LigandPNGBDBM50337746(4-(((1R)-7,7-dimethyl-2-oxobicyclo[2.2.1]heptan-1-...)
Affinity DataKi:  1.24E+3nM. Assay description: Inhibition of human recombinant CA1 cytosolic isoform by stopped-flow CO2 hydration assay
In DepthDetails ArticlePubMed