BDBM50341768 4-{5-[(2-Phenyl-5-trifluoromethyloxazole-4-carbonyl)-amino]pyridin-2-yl}piperazine-1-carboxylic Acid Methyl Ester::CHEMBL1766887
SMILES COC(=O)N1CCN(CC1)c1ccc(NC(=O)c2nc(oc2C(F)(F)F)-c2ccccc2)cn1
InChI Key InChIKey=YPNQNECOMVEDKT-UHFFFAOYSA-N
Data  1 IC50  1 EC50
  Tab Delimited (TSV)   2D SDfile   Computed 3D by Vconf -m prep SDfile
Find this compound or compounds like it in BindingDB:
Activity Spreadsheet -- Enzyme Inhibition Constant Data from BindingDB
Found 2 hits for monomerid = 50341768
TargetDiacylglycerol O-acyltransferase 1(Homo sapiens (Human))
Hoffmann-La Roche
Curated by ChEMBL
LigandPNGBDBM50341768(4-{5-[(2-Phenyl-5-trifluoromethyloxazole-4-carbony...)
Affinity DataIC50:  28nM. Assay description: Inhibition of human DGAT1 expressed in baculovirus infected insect cells after 1 hr using palmitoyl-1-14C-coenzyme A by phospholipid flashplate assay
In DepthDetails ArticlePubMed
TargetDiacylglycerol O-acyltransferase 1(Homo sapiens (Human))
Hoffmann-La Roche
Curated by ChEMBL
LigandPNGBDBM50341768(4-{5-[(2-Phenyl-5-trifluoromethyloxazole-4-carbony...)
Affinity DataEC50:  216nM. Assay description: Inhibition of human DGAT1 expressed in CHO-K1 cells after 1 hr using palmitoyl-1-14C-coenzyme A by phospholipid flashplate assay
In DepthDetails ArticlePubMed