BDBM50341783 4-(4-{4-[(2-Phenyl-5-trifluoromethyloxazole-4-carbonyl)-amino]phenyl}piperidine-1-carbonyl)-cis-cyclohexanecarboxylic Acid::CHEMBL1766812
SMILES OC(=O)[C@H]1CC[C@H](CC1)C(=O)N1CCC(CC1)c1ccc(NC(=O)c2nc(oc2C(F)(F)F)-c2ccccc2)cc1
InChI Key InChIKey=MARFUFVBECBSBC-SZPZYZBQSA-N
Data  1 IC50  1 EC50
  Tab Delimited (TSV)   2D SDfile   Computed 3D by Vconf -m prep SDfile
Find this compound or compounds like it in BindingDB:
Activity Spreadsheet -- Enzyme Inhibition Constant Data from BindingDB
Found 2 hits for monomerid = 50341783
TargetDiacylglycerol O-acyltransferase 1(Homo sapiens (Human))
Hoffmann-La Roche
Curated by ChEMBL
LigandPNGBDBM50341783(4-(4-{4-[(2-Phenyl-5-trifluoromethyloxazole-4-carb...)
Affinity DataIC50:  82nM. Assay description: Inhibition of human DGAT1 expressed in baculovirus infected insect cells after 1 hr using palmitoyl-1-14C-coenzyme A by phospholipid flashplate assay
In DepthDetails ArticlePubMed
TargetDiacylglycerol O-acyltransferase 1(Homo sapiens (Human))
Hoffmann-La Roche
Curated by ChEMBL
LigandPNGBDBM50341783(4-(4-{4-[(2-Phenyl-5-trifluoromethyloxazole-4-carb...)
Affinity DataEC50:  220nM. Assay description: Inhibition of human DGAT1 expressed in CHO-K1 cells after 1 hr using palmitoyl-1-14C-coenzyme A by phospholipid flashplate assay
In DepthDetails ArticlePubMed