BDBM50342387 3-Amino-6-(2-dimethylamino-ethylamino)-4-methylthieno[2,3-b]pyridine-2-carboxylic acid naphthalen-1-yl-methylene-hydrazide::CHEMBL1765555
SMILES CN(C)CCNc1cc(C)c2c(N)c(sc2n1)C(=O)N\N=C\c1cccc2ccccc12
InChI Key InChIKey=XFJRPFOPRPNCPR-MZJWZYIUSA-N
Data  1 IC50
  Tab Delimited (TSV)   2D SDfile   Computed 3D by Vconf -m prep SDfile
Find this compound or compounds like it in BindingDB:
Activity Spreadsheet -- Enzyme Inhibition Constant Data from BindingDB
Found 1 hit for monomerid = 50342387
TargetProto-oncogene tyrosine-protein kinase Src(Homo sapiens (Human))
Institut De Recherches Servier
Curated by ChEMBL
LigandPNGBDBM50342387(3-Amino-6-(2-dimethylamino-ethylamino)-4-methylthi...)
Affinity DataIC50:  230nM. Assay description: Inhibition of c-SRC assessed as residual activity using KVEKIGEGYYGVVYK as peptide substrate after 20 mins by scintillation counting
In DepthDetails ArticlePubMed