BDBM50342886 (1S,2S,3S,4S,5S)-5-[4-Chloro-3-(4-methoxybenzyl)-phenyl]-1-(hydroxymethyl)-6,8-dioxa-bicyclo[3.2.1]octane-2,3,4-triol::CHEMBL1770247
SMILES COc1ccc(Cc2cc(ccc2Cl)[C@]23OC[C@](CO)(O2)[C@@H](O)[C@H](O)[C@@H]3O)cc1
InChI Key InChIKey=RJTVHYMNUOKZQZ-SXYSDOLCSA-N
Data  2 IC50
  Tab Delimited (TSV)   2D SDfile   Computed 3D by Vconf -m prep SDfile
Find this compound or compounds like it in BindingDB:
Activity Spreadsheet -- Enzyme Inhibition Constant Data from BindingDB
Found 2 hits for monomerid = 50342886
TargetSolute carrier family 5 member 4(Homo sapiens (Human))
Pfizer
Curated by ChEMBL
LigandPNGBDBM50342886((1S,2S,3S,4S,5S)-5-[4-Chloro-3-(4-methoxybenzyl)-p...)
Affinity DataIC50:  43.1nM. Assay description: Inhibition of human SGLT2 expressed in CHO cells assessed as inhibition of methyl alpha-D-glucopyranoside uptake after 1 hr
In DepthDetails ArticlePubMed
TargetSodium/glucose cotransporter 1(Homo sapiens (Human))
Pfizer
Curated by ChEMBL
LigandPNGBDBM50342886((1S,2S,3S,4S,5S)-5-[4-Chloro-3-(4-methoxybenzyl)-p...)
Affinity DataIC50: >1.00E+4nM. Assay description: Inhibition of human SGLT1 expressed in CHO cells assessed as inhibition of methyl alpha-D-glucopyranoside uptake after 1 hr
In DepthDetails ArticlePubMed