BDBM50343032 CHEMBL1771371::rac-(Naphthalen-1-yl(palmitamido)methyl)phosphonic acid
SMILES CCCCCCCCCCCCCCCC(=O)NC(c1cccc2ccccc12)P(O)(O)=O
InChI Key InChIKey=CIQWMTQCEZEPEO-UHFFFAOYSA-N
Data  1 KI
  Tab Delimited (TSV)   2D SDfile   Computed 3D by Vconf -m prep SDfile
Find this compound or compounds like it in BindingDB:
Activity Spreadsheet -- Enzyme Inhibition Constant Data from BindingDB
Found 1 hit for monomerid = 50343032
TargetFe(3+)-Zn(2+) purple acid phosphatase(Phaseolus vulgaris)
The University Of Queensland
Curated by ChEMBL
LigandPNGBDBM50343032(CHEMBL1771371 | rac-(Naphthalen-1-yl(palmitamido)m...)
Affinity DataKi:  3.10E+4nMpH: 4.9Assay Description:Competitive inhibition of red kidney bean PAP using para-nitrophenol as substrate at pH 4.9 preincubated for 10 mins by UV-visible spectrophotometry
In DepthDetails ArticlePubMed