BDBM50344531 4-(2-(4-chlorophenylamino)benzo[d]thiazol-5-yloxy)-N-methylpicolinamide::CHEMBL1778404
SMILES CNC(=O)c1cc(Oc2ccc3sc(Nc4ccc(Cl)cc4)nc3c2)ccn1
InChI Key InChIKey=LIFNMRKOLKQQQM-UHFFFAOYSA-N
Data  1 IC50
  Tab Delimited (TSV)   2D SDfile   Computed 3D by Vconf -m prep SDfile
Find this compound or compounds like it in BindingDB:
Activity Spreadsheet -- Enzyme Inhibition Constant Data from BindingDB
Found 1 hit for monomerid = 50344531
TargetRAF proto-oncogene serine/threonine-protein kinase(Homo sapiens (Human))
Novartis Institutes For Biomedical Research
Curated by ChEMBL
LigandPNGBDBM50344531(4-(2-(4-chlorophenylamino)benzo[d]thiazol-5-yloxy)...)
Affinity DataIC50:  4nM. Assay description: Inhibition of c-Raf assessed as phosphorylation of MEK1/2 by ELISA
In DepthDetails ArticlePubMed