BDBM50345016 2-(5-(trifluoromethyl)biphenyl-2-yloxy)acetic acid::CHEMBL1778614
SMILES OC(=O)COc1ccc(cc1-c1ccccc1)C(F)(F)F
InChI Key InChIKey=UJYGJIXXTAYAHQ-UHFFFAOYSA-N
Data  1 IC50
  Tab Delimited (TSV)   2D SDfile   Computed 3D by Vconf -m prep SDfile
Find this compound or compounds like it in BindingDB:
Activity Spreadsheet -- Enzyme Inhibition Constant Data from BindingDB
Found 1 hit for monomerid = 50345016
TargetProstaglandin D2 receptor 2(Homo sapiens (Human))
Astrazeneca R&D Charnwood
Curated by ChEMBL
LigandPNGBDBM50345016(2-(5-(trifluoromethyl)biphenyl-2-yloxy)acetic acid...)
Affinity DataIC50:  45nM. Assay description: Displacement of [3H]-PGD2 from CRTh2 receptor by scintillation proximity assay
In DepthDetails ArticlePubMed