BDBM50345017 2-(5-chlorobiphenyl-2-yloxy)acetic acid::CHEMBL1778613
SMILES OC(=O)COc1ccc(Cl)cc1-c1ccccc1
InChI Key InChIKey=UPWDVXOBZKNLLM-UHFFFAOYSA-N
Data  1 IC50
  Tab Delimited (TSV)   2D SDfile   Computed 3D by Vconf -m prep SDfile
Find this compound or compounds like it in BindingDB:
Activity Spreadsheet -- Enzyme Inhibition Constant Data from BindingDB
Found 1 hit for monomerid = 50345017
TargetProstaglandin D2 receptor 2(Homo sapiens (Human))
Astrazeneca R&D Charnwood
Curated by ChEMBL
LigandPNGBDBM50345017(2-(5-chlorobiphenyl-2-yloxy)acetic acid | CHEMBL17...)
Affinity DataIC50:  251nM. Assay description: Displacement of [3H]-PGD2 from CRTh2 receptor by scintillation proximity assay
In DepthDetails ArticlePubMed